phyllocladanol

Kovats' RI, non-polar column, isothermal

Data compiled by: NIST Mass Spectrometry Data Center, William E. Wallace, director

Column type PackedPacked
Active phase OV-101OV-101
Column length (m) 2.52.5
Carrier gas
Substrate Chromaton N-AW-DMCSChromaton N-AW-DMCS
Column diameter (mm)
Phase thickness (μm)
Temperature (C) 200.210.
I 2180.2205.
ReferenceKosyukova and Khorguani, 1989Kosyukova and Khorguani, 1989
Comment MSDC-RI MSDC-RI

References

Kosyukova and Khorguani, 1989
Kosyukova, L.V.; Khorguani, T.V., Retention indices of diterpenes isolated from resins of coniferous trees, Zh. Anal. Khim., 1989, 44, 9, 1309-1313. [all data]