Docosanoic acid, 20-methyl, trimethylsilyl ester

Van Den Dool and Kratz RI, non-polar column, temperature ramp

Data compiled by: NIST Mass Spectrometry Data Center, William E. Wallace, director

Column type Capillary
Active phase OV-1
Column length (m) 50.
Carrier gas He
Substrate
Column diameter (mm) 0.30
Phase thickness (μm) 0.52
Tstart (C) 130.
Tend (C) 280.
Heat rate (K/min) 2.
Initial hold (min)
Final hold (min)
I 2708.
ReferenceHarvey, 1989
Comment MSDC-RI

References

Harvey, 1989
Harvey, D.J., Identification of long-chain fatty acids and alcohols from human cerumen by the use of picolinyl and nicotinate esters, Biomed. Environ. Mass Spectrom., 1989, 18, 9, 719-723, https://doi.org/10.1002/bms.1200180912 . [all data]