trans-di-2-butyl-diazene

Kovats' RI, non-polar column, isothermal

View large format table.

Column type Active phase Temperature (C) I Reference Comment
CapillaryMethyl Silicone50.868.4Görgényi, Fekete, et al., 198950. m/0.32 mm/1. μm, N2

References

Görgényi, Fekete, et al., 1989
Görgényi, M.; Fekete, Z.; Seres, L., Estimation and prediction of the retention indices of selected trans-diazenes, Chromatographia, 1989, 27, 11/12, 581-584, https://doi.org/10.1007/BF02258982 . [all data]