4-Hydroxyoestrone (enol), TMS

Van Den Dool and Kratz RI, non-polar column, temperature ramp

View large format table.

Column type Active phase I Reference Comment
CapillaryDB-52789.Gerhardt, Ludwig-Köhn, et al., 198925. m/0.32 mm/0.25 μm, H2, 2. K/min; Tstart: 120. C; Tend: 270. C

References

Gerhardt, Ludwig-Köhn, et al., 1989
Gerhardt, K.; Ludwig-Köhn, H.; Henning, H.V.; Remberg, G.; Zeeck, A., Identification of oestrogen metabolites in human urine by capillary gas chromatography and mass spectrometry, Biomed. Environ. Mass Spectrom., 1989, 18, 2, 87-95, https://doi.org/10.1002/bms.1200180202 . [all data]