1-trans-2-methylisopropylcyclopentane

Kovats' RI, non-polar column, isothermal

Data compiled by: NIST Mass Spectrometry Data Center, William E. Wallace, director

Column type CapillaryCapillary
Active phase SqualaneSqualane
Column length (m) 50.50.
Carrier gas HeHe
Substrate
Column diameter (mm) 0.220.22
Phase thickness (μm)
Temperature (C) 50.70.
I 868.9870.4
ReferenceLunskii and Paizanskaya, 1988Lunskii and Paizanskaya, 1988
Comment MSDC-RI MSDC-RI

References

Lunskii and Paizanskaya, 1988
Lunskii, M.Kh.; Paizanskaya, I.L., Identification of hydrocarbons C1-C9 of petrol fractions of oils and condensates in the use of capillary columns with dinonylphthalate, Zh. Anal. Khim., 1988, 43, 127-135. [all data]