N1N1-dimethyl-N2-ortho-hydroxyphenylformamidine

Kovats' RI, non-polar column, isothermal

View large format table.

Column type Active phase Temperature (C) I Reference Comment
PackedSE-30240.1478.Dolecka, Raczynska, et al., 1988He, Chromosorb W AW; Column length: 2. m

References

Dolecka, Raczynska, et al., 1988
Dolecka, E.; Raczynska, E.D.; Drapala, T., Retention indices and basicity of N1N1-dimethyl-N2-phenylformamidines ortho-substituent effect, J. Chem. Soc. Perkin Trans. 2:, 1988, 3, 257-260, https://doi.org/10.1039/p29880000257 . [all data]