Poligodial + 3-methoxy-4,5-methylenedioxyamphetamine (R,S) adduct, # 2

Normal alkane RI, non-polar column, custom temperature program

Data compiled by: NIST Mass Spectrometry Data Center, William E. Wallace, director

Column type Capillary
Active phase CP Sil 5 CB
Column length (m) 25.
Carrier gas He
Substrate
Column diameter (mm) 0.32
Phase thickness (μm)
Program 80 0C (1 min) 30 K/min -> 160 0C 2 K/min -> 260 0C
I 3016.
ReferenceBrooks, Brindle, et al., 1988
Comment MSDC-RI

References

Brooks, Brindle, et al., 1988
Brooks, C.J.W.; Brindle, P.A.; Cole, W.J.; Watson, D.G., Note. Analytical separations of enantiomeric primary amines as pyrrole derivatives formed by reaction with polygodial, J. Chromatogr., 1988, 438, 108-110, https://doi.org/10.1016/S0021-9673(00)90239-5 . [all data]