β-D-lyxofuranose, TMS

Kovats' RI, non-polar column, isothermal

View large format table.

Column type Active phase Temperature (C) I Reference Comment
CapillarySE-54180.1615.Paez, Martínez-Castro, et al., 1987Column length: 45. m; Column diameter: 0.18 mm

References

Paez, Martínez-Castro, et al., 1987
Paez, M.; Martínez-Castro, I.; Sanz, J.; Olano, A.; García-Raso, A.; Saura-Calixto, F., Identification of the components of aldoses in a tautomeric equilibrium mixture as their trimethylsilyl ethers by capillary cas chromatography, Chromatographia, 1987, 23, 1, 43-46, https://doi.org/10.1007/BF02310417 . [all data]