α-D-lyxofuranose, TMS

Kovats' RI, non-polar column, isothermal

Data compiled by: NIST Mass Spectrometry Data Center, William E. Wallace, director

Column type Capillary
Active phase SE-54
Column length (m) 45.
Carrier gas
Substrate
Column diameter (mm) 0.18
Phase thickness (μm)
Temperature (C) 180.
I 1633.
ReferencePaez, Martínez-Castro, et al., 1987
Comment MSDC-RI

References

Paez, Martínez-Castro, et al., 1987
Paez, M.; Martínez-Castro, I.; Sanz, J.; Olano, A.; García-Raso, A.; Saura-Calixto, F., Identification of the components of aldoses in a tautomeric equilibrium mixture as their trimethylsilyl ethers by capillary cas chromatography, Chromatographia, 1987, 23, 1, 43-46, https://doi.org/10.1007/BF02310417 . [all data]