A-Arabinopyranose, TMS

Kovats' RI, non-polar column, isothermal

View large format table.

Column type Active phase Temperature (C) I Reference Comment
CapillarySE-54180.1601.García-Raso, Martínez-Castro, et al., 1987Column length: 40. m; Column diameter: 0.18 mm
CapillarySE-54180.1601.Paez, Martínez-Castro, et al., 1987Column length: 45. m; Column diameter: 0.18 mm

Kovats' RI, polar column, isothermal

View large format table.

Column type Active phase Temperature (C) I Reference Comment
CapillaryCarbowax 20M160.1524.García-Raso, Martínez-Castro, et al., 1987Column length: 25. m; Column diameter: 0.22 mm

References

García-Raso, Martínez-Castro, et al., 1987
García-Raso, A.; Martínez-Castro, I.; Páez, M.I.; Sanz, J.; García-Raso, J.; Saura-Calixto, F., Gas Chromatographic Behaviour of Carbohydrate Trimethylsilyl Ethers. I. Aldopentoses, J. Chromatogr., 1987, 398, 9-20, https://doi.org/10.1016/S0021-9673(01)96491-X . [all data]

Paez, Martínez-Castro, et al., 1987
Paez, M.; Martínez-Castro, I.; Sanz, J.; Olano, A.; García-Raso, A.; Saura-Calixto, F., Identification of the components of aldoses in a tautomeric equilibrium mixture as their trimethylsilyl ethers by capillary cas chromatography, Chromatographia, 1987, 23, 1, 43-46, https://doi.org/10.1007/BF02310417 . [all data]