N,N-Dimethyl-N'-phenyl-isobutyramidine

Kovats' RI, non-polar column, isothermal

Data compiled by: NIST Mass Spectrometry Data Center, William E. Wallace, director

Column type Packed
Active phase SE-30
Column length (m) 3.
Carrier gas N2
Substrate Chromosorb W AW
Column diameter (mm)
Phase thickness (μm)
Temperature (C) 240.
I 1541.
ReferenceOszczapowicz, Ciszkowski, et al., 1986
Comment MSDC-RI

References

Oszczapowicz, Ciszkowski, et al., 1986
Oszczapowicz, J.; Ciszkowski, K.; Osek, J., Amidines. XXVI. Retention indices of N1,N1-dimethylpropionamidines, isobutyramidines, pivalamidines and phenylacetamidines on a non-polar column, J. Chromatogr., 1986, 362, 383-389, https://doi.org/10.1016/S0021-9673(01)86990-9 . [all data]