N,N-Dimethyl-N'-(4-methoxyphenyl)-pivalamidine

Kovats' RI, non-polar column, isothermal

View large format table.

Column type Active phase Temperature (C) I Reference Comment
PackedSE-30240.1765.Oszczapowicz, Ciszkowski, et al., 1986N2, Chromosorb W AW; Column length: 3. m

References

Oszczapowicz, Ciszkowski, et al., 1986
Oszczapowicz, J.; Ciszkowski, K.; Osek, J., Amidines. XXVI. Retention indices of N1,N1-dimethylpropionamidines, isobutyramidines, pivalamidines and phenylacetamidines on a non-polar column, J. Chromatogr., 1986, 362, 383-389, https://doi.org/10.1016/S0021-9673(01)86990-9 . [all data]