N-(3-Methoxyphenyl)-N'-(3-chlorophenyl)formamidine

Kovats' RI, non-polar column, isothermal

View large format table.

Column type Active phase Temperature (C) I Reference Comment
PackedSE-30240.2458.Osek, Jaroszewska-Manaj, et al., 1986N2, Chromosorb W AW (60-80 mesh); Column length: 1. m

References

Osek, Jaroszewska-Manaj, et al., 1986
Osek, J.; Jaroszewska-Manaj, J.; Krawczyk, W.; Oszczapowicz, J., Gas chromatographic analysis of tautomerizing amidines. Retention indices of N,N'-diphenylformamidines on a non-polar column, J. Chromatogr., 1986, 369, 398-402, https://doi.org/10.1016/S0021-9673(00)90146-8 . [all data]