Trimethoxypentylsilane

Kovats' RI, non-polar column, isothermal

View large format table.

Column type Active phase Temperature (C) I Reference Comment
PackedApiezon M160.985.Peetre, Ellren, et al., 1985Chromosorb G; Column length: 3. m

References

Peetre, Ellren, et al., 1985
Peetre, I.-B.; Ellren, O.; Smith, B.E.F., Gas chromatographic investigation of organometallic compounds and their carbon analogues. VI. Determination, calculation and correlation of Kováts retention indices for alkylalkoxysilanes, J. Chromatogr., 1985, 318, 41-55, https://doi.org/10.1016/S0021-9673(01)90662-4 . [all data]