N,N-Dimethyl-N'-(4-chlorophenyl)-p-methylbenzamidine

Kovats' RI, non-polar column, isothermal

Data compiled by: NIST Mass Spectrometry Data Center, William E. Wallace, director

Column type Packed
Active phase SE-30
Column length (m) 3.
Carrier gas N2
Substrate Chromosorb A AW
Column diameter (mm)
Phase thickness (μm)
Temperature (C) 280.
I 2112.
ReferenceOszczapowicz, Osek, et al., 1985
Comment MSDC-RI

References

Oszczapowicz, Osek, et al., 1985
Oszczapowicz, J.; Osek, J.; Ciszkowski, K.; Krawczyk, W.; Ostrowski, M., Retention Indices of Dimethylbenzamidines and Benzylideneamines on a Non-Polar Column, J. Chromatogr., 1985, 330, 79-85, https://doi.org/10.1016/S0021-9673(01)81964-6 . [all data]