isopropenylcyclohexane

Kovats' RI, non-polar column, isothermal

View large format table.

Column type Active phase Temperature (C) I Reference Comment
CapillaryOV-101100.930.Engewald, Topalova, et al., 1987Column length: 50. m; Column diameter: 0.30 mm
CapillarySE-3080.924.6Albaigés and Guardino, 1980He; Column length: 64. m; Column diameter: 0.25 mm
CapillarySqualane80.920.5Albaigés and Guardino, 1980He; Column length: 100. m; Column diameter: 0.25 mm

References

Engewald, Topalova, et al., 1987
Engewald, W.; Topalova, I.; Petsev, N.; Dimitrov, Chr., Structure-Retention Correlations of Hydrocarbons in GLC and GSC. Alkenylbenzenes, Chromatographia, 1987, 23, 8, 561-565, https://doi.org/10.1007/BF02324864 . [all data]

Albaigés and Guardino, 1980
Albaigés, J.; Guardino, X., Gas chromatographic-mass spectrometric identification of alkylcyclohexanes and cyclohexenes, Chromatographia, 1980, 13, 12, 755-762, https://doi.org/10.1007/BF02265555 . [all data]