β-fenchene

Kovats' RI, non-polar column, isothermal

View large format table.

Column type Active phase Temperature (C) I Reference Comment
CapillarySE-30100.949.1Saeed, Redant, et al., 197980. m/0.5 mm/0.8 μm
CapillarySE-30110.948.5Saeed, Redant, et al., 197980. m/0.5 mm/0.8 μm
CapillarySE-30130.955.6Saeed, Redant, et al., 197980. m/0.5 mm/0.8 μm

Kovats' RI, non-polar column, temperature ramp

View large format table.

Column type Active phase I Reference Comment
CapillaryDB-5948.Buchin, Salmon, et al., 200260. m/0.32 mm/1. μm, He, 40. C @ 5. min, 3. K/min, 230. C @ 2. min

Kovats' RI, polar column, isothermal

View large format table.

Column type Active phase Temperature (C) I Reference Comment
CapillaryCarbowax 20M100.1075.Saeed, Redant, et al., 1979Phase thickness: 0.5 μm
CapillaryCarbowax 20M70.1057.2Saeed, Redant, et al., 1979Phase thickness: 0.5 μm
CapillaryCarbowax 20M90.1070.Saeed, Redant, et al., 1979Phase thickness: 0.5 μm

Van Den Dool and Kratz RI, non-polar column, temperature ramp

View large format table.

Column type Active phase I Reference Comment
CapillaryRSL-200986.Ngassoum, Ousmaila, et al., 200430. m/0.32 mm/0.25 μm, H2, 40. C @ 5. min, 6. K/min, 280. C @ 5. min

Normal alkane RI, non-polar column, custom temperature program

View large format table.

Column type Active phase I Reference Comment
CapillarySE-30940.Vinogradov, 2004Program: not specified
CapillaryDB-5921.Isidorov, Zenkevich, et al., 1997Program: not specified
CapillaryMethyl Silicone940.Zenkevich, 1996Program: not specified

Normal alkane RI, polar column, custom temperature program

View large format table.

Column type Active phase I Reference Comment
CapillaryCarbowax 20M1063.Vinogradov, 2004Program: not specified

References

Saeed, Redant, et al., 1979
Saeed, T.; Redant, G.; Sandra, P., Kovats Indices of Monoterpene Hydrocarbons on Glass Capillary Columns, J. Hi. Res. Chromatogr. Chromatogr. Comm., 1979, 2, 2, 75-76, https://doi.org/10.1002/jhrc.1240020208 . [all data]

Buchin, Salmon, et al., 2002
Buchin, S.; Salmon, J.-C.; Carnat, A.-P.; Berger, T.; Bugaud, C.; Bosset, J.O., Identification de composés monoterpéniques, sesquiterpéniques et benzéniques dans un lait d'alpage très riche en ces substances, Mitt. Lebensmittelunters. Hyg., 2002, 93, 199-216. [all data]

Ngassoum, Ousmaila, et al., 2004
Ngassoum, M.B.; Ousmaila, H.; Ngamo, L.T.; Maponmetsem, P.M.; Jirovetz, L.; Buchbauer, G., Aroma compounds of essential oils of two varieties of the spice plant Ocimum canum Sims from northern Cameroon, J. Food Comp. Anal., 2004, 17, 2, 197-204, https://doi.org/10.1016/j.jfca.2003.08.002 . [all data]

Vinogradov, 2004
Vinogradov, B.A., Production, composition, properties and application of essential oils, 2004, retrieved from http://viness.narod.ru. [all data]

Isidorov, Zenkevich, et al., 1997
Isidorov, V.; Zenkevich, I.; Sacharevich, T., Calculation of Gas Chromatographic Retention Indices for Monoterpenes and Terpenoids from Their Physico-Chemical Constants, Chem. Anal. (Warsaw), 1997, 42, 627-634. [all data]

Zenkevich, 1996
Zenkevich, I.G., Analytical Parameters of Components of Essential Oils for their Chromatographic and Chromato-Mass Spectral Identification. Mono- and Sesquiterpenes, Rastitelnye Resursy (Plant resources), 1996, 34, 1-2, 48-58. [all data]