Ethyl isopentyl sulfide

Kovats' RI, non-polar column, isothermal

Data compiled by: NIST Mass Spectrometry Data Center, William E. Wallace, director

Column type Packed
Active phase Apiezon M
Column length (m) 2.1
Carrier gas He or N2
Substrate Chromosorb W, AW-DMCS
Column diameter (mm)
Phase thickness (μm)
Temperature (C) 130.
I 954.
ReferenceGarbuzov, Misharina, et al., 1985
Comment MSDC-RI

References

Garbuzov, Misharina, et al., 1985
Garbuzov, V.G.; Misharina, T.A.; Aerov, A.F.; Golovnya, R.V., Gas chromatographic retention indices for sulphur(II)-containing organic substances, J. Anal. Chem. USSR (Engl. Transl.), 1985, 40, 4, 576-586. [all data]