3,5,5-trimethyl-4-thiaheptane

Normal alkane RI, non-polar column, custom temperature program

Data compiled by: NIST Mass Spectrometry Data Center, William E. Wallace, director

Column type CapillaryPacked
Active phase Apiezon MApiezon M
Column length (m)
Carrier gas
Substrate
Column diameter (mm)
Phase thickness (μm)
Program not specifiednot specified
I 1050.1050.
ReferenceLiu, Cao, et al., 2005Yu and Yang, 2005
Comment MSDC-RI MSDC-RI

References

Liu, Cao, et al., 2005
Liu, L.; Cao, C.-Z.; Xie, B.; Zou, L.-K., Research of QSSR on chromatography retention index of sulfides and mercaptans, Journal of Hunan University of Science and Technology, 2005, 20, 4, 74-80. [all data]

Yu and Yang, 2005
Yu, X.; Yang, D., Predicting the Kovats retention index for alkoxyl silicon chlorides and sulfides on stationary phases of different polarity, Fenxi Huaxue, 2005, 33, 1, 101-105. [all data]