9H-Fluorene, 9-butyl

Lee's RI, non-polar column, temperature ramp

Data compiled by: NIST Mass Spectrometry Data Center, William E. Wallace, director

Column type Capillary
Active phase SE-52
Column length (m) 12.
Carrier gas He
Substrate
Column diameter (mm) 0.3
Phase thickness (μm) 0.34
Tstart (C) 50.
Tend (C) 250.
Heat rate (K/min) 2.
Initial hold (min)
Final hold (min)
I 328.99
ReferenceLee, Vassilaros, et al., 1979
Comment MSDC-RI

Lee's RI, non-polar column, custom temperature program

Data compiled by: NIST Mass Spectrometry Data Center, William E. Wallace, director

Column type Capillary
Active phase SE-52
Column length (m)
Carrier gas
Substrate
Column diameter (mm)
Phase thickness (μm)
Program not specified
I 328.99
ReferenceShlyakhov, 1984
Comment MSDC-RI

References

Lee, Vassilaros, et al., 1979
Lee, M.L.; Vassilaros, D.L.; White, C.M.; Novotny, M., Retention Indices for Programmed-Temperature Capillary-Column Gas Chromatography of Polycyclic Aromatic Hydrocarbons, Anal. Chem., 1979, 51, 6, 768-773, https://doi.org/10.1021/ac50042a043 . [all data]