LACTULOSE (8TMS)

Kovats' RI, non-polar column, temperature ramp

View large format table.

Column type Active phase I Reference Comment
CapillaryDB-5MS2697.Medeiros and Simoneit, 200730. m/0.25 mm/0.25 μm, He, 65. C @ 2. min, 6. K/min, 300. C @ 15. min

Van Den Dool and Kratz RI, non-polar column, temperature ramp

View large format table.

Column type Active phase I Reference Comment
CapillaryDB-5MS2691.7Jonsson, Johansson, et al., 200510. m/0.18 mm/0.18 μm, 70. C @ 2. min, 40. K/min, 320. C @ 2. min
CapillaryDB-5MS2698.1Jonsson, Johansson, et al., 200510. m/0.18 mm/0.18 μm, 70. C @ 2. min, 40. K/min, 320. C @ 2. min

References

Medeiros and Simoneit, 2007
Medeiros, P.M.; Simoneit, B.R.T., Analysis of sugars in environmental samples by gas chromatography-mass spectrometry, J. Chromatogr. A, 2007, 1141, 2, 271-278, https://doi.org/10.1016/j.chroma.2006.12.017 . [all data]

Jonsson, Johansson, et al., 2005
Jonsson, P.; Johansson, A.I.; Gullberg, J.; Trygg, J.; Jiye, A.; Grung, B.; Marklund, S.; Sjöström, M.; Antti, H.; Moritz, T., High-throughput data analysis for detecting and identifying differences between samples in GC/MS-based metabolomic analyses, Anal. Chem., 2005, 77, 17, 5635-5642, https://doi.org/10.1021/ac050601e . [all data]