N'-(4-ethoxy-phenyl)-N,N-dimethyl-acetamidine

Kovats' RI, non-polar column, isothermal

Data compiled by: NIST Mass Spectrometry Data Center, William E. Wallace, director

Column type Packed
Active phase SE-30
Column length (m) 3.
Carrier gas N2
Substrate Chromosorb W AW
Column diameter (mm)
Phase thickness (μm)
Temperature (C) 240.
I 1748.
ReferenceOszczapowicz, Osek, et al., 1984
Comment MSDC-RI

References

Oszczapowicz, Osek, et al., 1984
Oszczapowicz, J.; Osek, J.; Dolecka, E., Retention indices of dimethylformamidines, dimethylacetamidines and tetramethylguanidines on a non-polar column, J. Chromatogr., 1984, 315, 95-100, https://doi.org/10.1016/S0021-9673(01)90727-7 . [all data]