5-α-Pregnane-3-β,17-α,20-α-triol, methylboronate

Normal alkane RI, non-polar column, custom temperature program

View large format table.

Column type Active phase I Reference Comment
CapillaryOV-12705.Brooks, Cole, et al., 198325. m/0.25 mm/0.25 μm; Program: 80 0C (5 min) 40 K/min -> 120 0C (2 min) 2 K/min -> 200 0C (for androstanes), or 80 0C (5 min) 40 K/min -> 190 0C (2 min) 2 K/min -> 270 0C (for sterols)

References

Brooks, Cole, et al., 1983
Brooks, C.J.W.; Cole, W.J.; Lawrie, T.D.V.; MacLachlan, J.; Borthwick, J.H.; Barrett, G.M., Selective reactions in the analytical characterisation of steroids by gas chromatography-mass spectrometry, J. Steroid Biochem., 1983, 19, 1, 189-201, https://doi.org/10.1016/S0022-4731(83)80025-9 . [all data]