Rhodoporphyrin-XV homologue, bis(trimethylsiloxy)silicon(IV) derivative

Van Den Dool and Kratz RI, non-polar column, temperature ramp

View large format table.

Column type Active phase I Reference Comment
CapillaryCP Sil 5 CB3905.Marriott and Eglinton, 1982H2, 6. K/min; Column length: 20. m; Column diameter: 0.34 mm; Tstart: 60. C; Tend: 295. C

References

Marriott and Eglinton, 1982
Marriott, P.J.; Eglinton, G., Capillary gas chromatography and gas chromatography-mass spectrometry of silicon(IV) derivatives of porphyrins with polar substitutes, J. Chromatogr., 1982, 249, 2, 311-321, https://doi.org/10.1016/S0021-9673(00)86341-4 . [all data]