1,5,5-trimethyl-9-oxabicyclo[4.3]non-6-en-3-one

Kovats' RI, non-polar column, temperature ramp

View large format table.

Column type Active phase I Reference Comment
CapillaryOV-1011500.Yamaguchi and Shibamoto, 1981N2, 2. K/min; Column length: 70. m; Column diameter: 0.28 mm; Tstart: 80. C; Tend: 200. C

Kovats' RI, polar column, temperature ramp

View large format table.

Column type Active phase I Reference Comment
CapillaryCarbowax 20M2090.Yamaguchi and Shibamoto, 1981N2, 2. K/min; Column length: 70. m; Column diameter: 0.28 mm; Tstart: 80. C; Tend: 200. C

References

Yamaguchi and Shibamoto, 1981
Yamaguchi, K.; Shibamoto, T., Volatile constituents of green tea, Gyokuro (Camellia sinensis L. var Yabukita), J. Agric. Food Chem., 1981, 29, 2, 366-370, https://doi.org/10.1021/jf00104a035 . [all data]