isobutyl thiobutyrate

Kovats' RI, non-polar column, isothermal

Data compiled by: NIST Mass Spectrometry Data Center, William E. Wallace, director

Column type PackedPacked
Active phase Apiezon MApiezon M
Column length (m) 2.12.1
Carrier gas He or N2
Substrate Chromosorb W, AW-DMCSChromosorb W, AW/DMCS
Column diameter (mm)
Phase thickness (μm)
Temperature (C) 130.130.
I 1088.1088.
ReferenceGarbuzov, Misharina, et al., 1985Golovnya, Garbuzov, et al., 1981
Comment MSDC-RI MSDC-RI

References

Garbuzov, Misharina, et al., 1985
Garbuzov, V.G.; Misharina, T.A.; Aerov, A.F.; Golovnya, R.V., Gas chromatographic retention indices for sulphur(II)-containing organic substances, J. Anal. Chem. USSR (Engl. Transl.), 1985, 40, 4, 576-586. [all data]

Golovnya, Garbuzov, et al., 1981
Golovnya, R.V.; Garbuzov, V.G.; Aérov, A.F., Comparison of the retention indices and differential molar free energies of solution for thiolic and carboxylic esters on gas-chromatographic columns with various polarities, Izv. Akad. Nauk SSSR Ser. Khim., 1981, 10, 1877-1880. [all data]