2,5-Heptadiene, (E,Z)

Kovats' RI, non-polar column, isothermal

View large format table.

Column type Active phase Temperature (C) I Reference Comment
CapillarySqualane70.712.3Soják, Ostrovský, et al., 1980N2; Column length: 200. m; Column diameter: 0.25 mm
CapillarySqualane70.708.8Soják, Ostrovský, et al., 1980N2; Column length: 70. m; Column diameter: 0.25 mm

References

Soják, Ostrovský, et al., 1980
Soják, L.; Ostrovský, I.; Leclercq, P.A.; Rijks, J.A., Identification of n-hepta- and n-octadienes by high-resolution gas chromatography using structure-retention correlations and mass spectrometry, J. Chromatogr., 1980, 191, 187-198, https://doi.org/10.1016/S0021-9673(00)86379-7 . [all data]