trans-4-Octadecene

Kovats' RI, polar column, isothermal

Data compiled by: NIST Mass Spectrometry Data Center, William E. Wallace, director

Column type CapillaryCapillary
Active phase PEG-20MCarbowax 20M
Column length (m)  300.
Carrier gas  N2
Substrate
Column diameter (mm)  0.25
Phase thickness (μm)
Temperature (C) 110.110.
I 1813.1813.2
ReferenceRang, Orav, et al., 1988Soják, Krupcík, et al., 1980
Comment MSDC-RI MSDC-RI

References

Rang, Orav, et al., 1988
Rang, S.A.; Orav, A.E.; Kuningas, K.R.; Meister, A.E.; Strense, T.V.; Eisen, O.G., Gas-Chromatographic Characteristics of unsaturated hydrocarbons, Academy of Sciences of Estonia SSR, Tallinn, Estonia SSR, 1988, 208. [all data]

Soják, Krupcík, et al., 1980
Soják, L.; Krupcík, J.; Janák, J., Gas chromatography of all C15-C18 linear alkenes on capillary columns with very high resolution power, J. Chromatogr., 1980, 195, 1, 43-64, https://doi.org/10.1016/S0021-9673(00)81542-3 . [all data]