cis-4-Heptadecene

Kovats' RI, non-polar column, isothermal

View large format table.

Column type Active phase Temperature (C) I Reference Comment
CapillaryApolane160.1681.2Soják, Krupcík, et al., 1980N2 or H2; Column length: 250. m; Column diameter: 0.25 mm
CapillaryApiezon L154.1682.3Soják, Krupcík, et al., 1980N2 or H2; Column length: 250. m; Column diameter: 0.25 mm

Kovats' RI, polar column, isothermal

View large format table.

Column type Active phase Temperature (C) I Reference Comment
CapillaryPEG-20M110.1715.Rang, Orav, et al., 1988
CapillaryCarbowax 20M110.1715.Soják, Krupcík, et al., 1980N2; Column length: 300. m; Column diameter: 0.25 mm

References

Soják, Krupcík, et al., 1980
Soják, L.; Krupcík, J.; Janák, J., Gas chromatography of all C15-C18 linear alkenes on capillary columns with very high resolution power, J. Chromatogr., 1980, 195, 1, 43-64, https://doi.org/10.1016/S0021-9673(00)81542-3 . [all data]

Rang, Orav, et al., 1988
Rang, S.A.; Orav, A.E.; Kuningas, K.R.; Meister, A.E.; Strense, T.V.; Eisen, O.G., Gas-Chromatographic Characteristics of unsaturated hydrocarbons, Academy of Sciences of Estonia SSR, Tallinn, Estonia SSR, 1988, 208. [all data]