3,7,10-Trimethylsilatrane, d

Kovats' RI, non-polar column, isothermal

View large format table.

Column type Active phase Temperature (C) I Reference Comment
PackedApiezon L200.1569.Shatz, Belikov, et al., 1979Chromosorb W HP; Column length: 1.2 m

References

Shatz, Belikov, et al., 1979
Shatz, V.D.; Belikov, V.A.; Zelchan, G.I.; Solomennikova, I.I.; Lukevics, E., Chromatography of organometallic and organometalloidal derivatives of amino alcohols. I. Retention indices of silatranes, J. Chromatogr., 1979, 174, 1, 83-95, https://doi.org/10.1016/S0021-9673(00)87039-9 . [all data]