Benz[a]acridine, 2,10-dimethyl

Van Den Dool and Kratz RI, non-polar column, temperature ramp

View large format table.

Column type Active phase I Reference Comment
CapillarySE-522670.Beernaert, 1979He, 50. C @ 5. min, 6. K/min; Column length: 33.3 m; Column diameter: 0.50 mm; Tend: 320. C

References

Beernaert, 1979
Beernaert, H., Gas Chromatographic Analysis of Polyclylic Aromatic Hydrocarbons, J. Chromatogr., 1979, 173, 1, 109-118, https://doi.org/10.1016/S0021-9673(01)80450-7 . [all data]