Benz[a]acridine, 5,7-dimethyl

Van Den Dool and Kratz RI, non-polar column, temperature ramp

Data compiled by: NIST Mass Spectrometry Data Center, William E. Wallace, director

Column type Capillary
Active phase SE-52
Column length (m) 33.3
Carrier gas He
Substrate
Column diameter (mm) 0.50
Phase thickness (μm)
Tstart (C) 50.
Tend (C) 320.
Heat rate (K/min) 6.
Initial hold (min) 5.
Final hold (min)
I 2662.
ReferenceBeernaert, 1979
Comment MSDC-RI

References

Beernaert, 1979
Beernaert, H., Gas Chromatographic Analysis of Polyclylic Aromatic Hydrocarbons, J. Chromatogr., 1979, 173, 1, 109-118, https://doi.org/10.1016/S0021-9673(01)80450-7 . [all data]