1-Butylsilatrane

Kovats' RI, polar column, isothermal

Data compiled by: NIST Mass Spectrometry Data Center, William E. Wallace, director

Column type Packed
Active phase Carbowax 20M
Column length (m) 2.4
Carrier gas
Substrate Chromosorb W HP
Column diameter (mm)
Phase thickness (μm)
Temperature (C) 200.
I 2440.
ReferenceShatz, Belikov, et al., 1979
Comment MSDC-RI

References

Shatz, Belikov, et al., 1979
Shatz, V.D.; Belikov, V.A.; Zelchan, G.I.; Solomennikova, I.I.; Lukevics, E., Chromatography of organometallic and organometalloidal derivatives of amino alcohols. I. Retention indices of silatranes, J. Chromatogr., 1979, 174, 1, 83-95, https://doi.org/10.1016/S0021-9673(00)87039-9 . [all data]