1-Octen-7-yne

Kovats' RI, non-polar column, isothermal

View large format table.

Column type Active phase Temperature (C) I Reference Comment
CapillarySqualane50.765.7Welsch, Engewald, et al., 1978Column length: 80. m; Column diameter: 0.23 mm

References

Welsch, Engewald, et al., 1978
Welsch, Th.; Engewald, W.; Berger, P., IX. Das gas-chromatographische Retentionsverhalten isomerer Octine and Octadiine, Chromatographia, 1978, 11, 1, 5-9, https://doi.org/10.1007/BF02262945 . [all data]