Thymidine, 3',5'-bis(O-TBDMSi)

Kovats' RI, non-polar column, isothermal

View large format table.

Column type Active phase Temperature (C) I Reference Comment
PackedOV-1230.2837.Quilliam, Ogilvie, et al., 1980N2, Gas-Chrom Q
PackedOV-1260.2866.Quilliam, Ogilvie, et al., 1980N2, Gas-Chrom Q
PackedOV-1230.2837.Quilliam and Westmore, 1978Gas Chrom Q; Column length: 1. m
PackedOV-1260.2866.Quilliam and Westmore, 1978Gas Chrom Q; Column length: 1. m

References

Quilliam, Ogilvie, et al., 1980
Quilliam, M.A.; Ogilvie, K.K.; Sadana, K.L.; Westmore, J.B., Gas chromatographic retention data for silyl and acyl derivatives of nucleosides, J. Chromatogr., 1980, 196, 3, 367-378, https://doi.org/10.1016/S0021-9673(00)84739-1 . [all data]

Quilliam and Westmore, 1978
Quilliam, M.A.; Westmore, J.B., Sterically crowded trialkylsilyl derivatives for chromatography and mass spectrometry of biologically-important compounds, Anal. Chem., 1978, 50, 1, 59-68, https://doi.org/10.1021/ac50023a020 . [all data]