2-thia-4-pentyne

Kovats' RI, non-polar column, isothermal

Data compiled by: NIST Mass Spectrometry Data Center, William E. Wallace, director

Column type PackedPacked
Active phase Apiezon MApiezon M
Column length (m) 2.12.1
Carrier gas He or N2
Substrate Chromosorb W, AW-DMCSChromosorb W, AW-DMCS
Column diameter (mm)
Phase thickness (μm)
Temperature (C) 130.130.
I 705.705.
ReferenceGarbuzov, Misharina, et al., 1985Golovnya, Misharina, et al., 1978
Comment MSDC-RI MSDC-RI

References

Garbuzov, Misharina, et al., 1985
Garbuzov, V.G.; Misharina, T.A.; Aerov, A.F.; Golovnya, R.V., Gas chromatographic retention indices for sulphur(II)-containing organic substances, J. Anal. Chem. USSR (Engl. Transl.), 1985, 40, 4, 576-586. [all data]

Golovnya, Misharina, et al., 1978
Golovnya, R.V.; Misharina, T.A.; Garbuzov, V.G., Gas chromatographic characterization of sulfur-containing compounds. 4. The effect of unsaturated radicals on the retention indices of the vinyl, allyl, and propargyl alkyl sulfides, Izv. Akad. Nauk SSSR Ser. Khim., 1978, 11, 2266-2270. [all data]