1,4-Dimethyladamantane, # 1

Kovats' RI, non-polar column, isothermal

View large format table.

Column type Active phase Temperature (C) I Reference Comment
CapillarySE-30110.1172.Bogoslovsky, Anvaer, et al., 1978
CapillarySE-30120.1183.Bogoslovsky, Anvaer, et al., 1978
CapillarySE-30130.1189.Bogoslovsky, Anvaer, et al., 1978
CapillarySE-30145.1205.Bogoslovsky, Anvaer, et al., 1978

References

Bogoslovsky, Anvaer, et al., 1978
Bogoslovsky, Yu.N.; Anvaer, B.I.; Vigdergauz, M.S., Chromatographic constants in gas chromatography (in Russian), Standards Publ. House, Moscow, 1978, 192. [all data]