2,4,6-trimethyl-3-ethylpyridine

Kovats' RI, non-polar column, isothermal

View large format table.

Column type Active phase Temperature (C) I Reference Comment
PackedApiezon L130.1228.Shatts, Avots, et al., 1977He, Chromosorb W AW-DMCS; Column length: 2.4 m

References

Shatts, Avots, et al., 1977
Shatts, V.D.; Avots, A.A.; Belikov, V.A., Retention indices of alkylpyridines, Zh. Anal. Khim., 1977, 32, 4, 631-638. [all data]