ent-α-selinene

Kovats' RI, non-polar column, isothermal

View large format table.

Column type Active phase Temperature (C) I Reference Comment
CapillaryApiezon L190.1554.7Ohta, Andersen, et al., 1977Column length: 7.3 m; Column diameter: 3.17 mm
CapillaryApiezon L190.1560.Ohta, Andersen, et al., 1977Column length: 7.3 m; Column diameter: 0.317 mm

Kovats' RI, polar column, isothermal

View large format table.

Column type Active phase Temperature (C) I Reference Comment
PackedCarbowax 20M165.1767.Ohta, Andersen, et al., 1977Column length: 7.3 m; Column diameter: 3.17 mm
PackedCarbowax 20M165.1765.4Ohta, Andersen, et al., 1977Column length: 7.3 m; Column diameter: 3.17 mm

References

Ohta, Andersen, et al., 1977
Ohta, Y.; Andersen, N.H.; Liu, C.-B., Sesquiterpene constituents of two liverworts of genus diplophyllum. Novel eudesmanolides and cytotoxicity studies for enantiomeric methylene lactones, Tetrahedron, 1977, 33, 6, 617-628, https://doi.org/10.1016/0040-4020(77)80301-3 . [all data]