(+)-β-bazzanene

Kovats' RI, non-polar column, isothermal

Data compiled by: NIST Mass Spectrometry Data Center, William E. Wallace, director

Column type PackedPacked
Active phase SF-96Apiezon L
Column length (m) 7.37.3
Carrier gas
Substrate
Column diameter (mm)
Phase thickness (μm)
Temperature (C) 170.190.
I 1535.51590.
ReferenceAndersen, Bissonette, et al., 1977Andersen, Bissonette, et al., 1977
Comment MSDC-RI MSDC-RI

References

Andersen, Bissonette, et al., 1977
Andersen, N.H.; Bissonette, P.; Liu, C.-B.; Shunk, B.; Ohta, Y.; Tseng, C.-L.W.; Moore, A.; Huneck, S., Sesquiterpenes of nine European liverworts from the genera, Anastrepta, Bazzania, Jungermannia, Lepidozia, and Scapania, Phytochemistry, 1977, 16, 11, 1731-1751, https://doi.org/10.1016/0031-9422(71)85081-1 . [all data]