1-(2,4,5-trichlorophenyl)-2-chloro-ethanol-1

Kovats' RI, non-polar column, isothermal

Data compiled by: NIST Mass Spectrometry Data Center, William E. Wallace, director

Column type PackedPackedPackedPacked
Active phase SE-30SE-30SE-30SE-30
Column length (m) 1.1.1.1.
Carrier gas
Substrate Chromaton N-AW-GMDSChromaton N-AW-GMDSChromaton N-AW-GMDSChromaton N-AW-GMDS
Column diameter (mm)
Phase thickness (μm)
Temperature (C) 150.160.170.180.
I 1711.1723.1732.1730.
ReferenceVylegzhanina and Keiser, 1976Vylegzhanina and Keiser, 1976Vylegzhanina and Keiser, 1976Vylegzhanina and Keiser, 1976
Comment MSDC-RI MSDC-RI MSDC-RI MSDC-RI

References

Vylegzhanina and Keiser, 1976
Vylegzhanina, G.F.; Keiser, L.S., Determination of the heats of solution of the insecticide gardona and its metabolites in the stationary phase and their Kovats retention indices, Zh. Anal. Khim., 1976, 31, 1, 171-173. [all data]