3-Thiadecane

Kovats' RI, non-polar column, isothermal

View large format table.

Column type Active phase Temperature (C) I Reference Comment
PackedApiezon M130.1193.Garbuzov, Misharina, et al., 1985He or N2, Chromosorb W, AW-DMCS; Column length: 2.1 m
PackedApiezon M130.1193.Golovnya, Garbuzov, et al., 1976N2, Chromosorb W; Column length: 2.1 m

Kovats' RI, polar column, isothermal

View large format table.

Column type Active phase Temperature (C) I Reference Comment
CapillaryPEG-20M93.1390.7Morishita, Murakita, et al., 1985Column length: 50. m; Column diameter: 0.25 mm
CapillaryPEG-20M80.1385.3Morishita, Murakita, et al., 1982N2; Column length: 50. m; Column diameter: 0.25 mm
PackedPolyethylene Glycol130.1411.Golovnya, Garbuzov, et al., 1976N2, Chromosorb W; Column length: 2.1 m

References

Garbuzov, Misharina, et al., 1985
Garbuzov, V.G.; Misharina, T.A.; Aerov, A.F.; Golovnya, R.V., Gas chromatographic retention indices for sulphur(II)-containing organic substances, J. Anal. Chem. USSR (Engl. Transl.), 1985, 40, 4, 576-586. [all data]

Golovnya, Garbuzov, et al., 1976
Golovnya, R.V.; Garbuzov, V.G.; Misharina, T.A., Gas chromatographic characteristics of sulfur compounds. 2. Normal sulfides, Izv. Akad. Nauk Kaz. SSR Ser. Khim., 1976, 10, 2266-2270. [all data]

Morishita, Murakita, et al., 1985
Morishita, F.; Murakita, H.; Kojima, T., Prediction of retention indices of thiols and sulfides under different conditions of capillary gas chromatography, Bunseki Kagaku, 1985, 34, 12, 800-802, https://doi.org/10.2116/bunsekikagaku.34.12_800 . [all data]

Morishita, Murakita, et al., 1982
Morishita, F.; Murakita, H.; Takemura, Y.; Kojima, T., Prediction of molecular structures of thiols and sulphides by retention indices, J. Chromatogr., 1982, 239, 483-492, https://doi.org/10.1016/S0021-9673(00)82005-1 . [all data]