5-Thiadodecane

Kovats' RI, polar column, isothermal

Data compiled by: NIST Mass Spectrometry Data Center, William E. Wallace, director

Column type Packed
Active phase Polyethylene Glycol
Column length (m) 2.1
Carrier gas N2
Substrate Chromosorb W
Column diameter (mm)
Phase thickness (μm)
Temperature (C) 130.
I 1584.
ReferenceGolovnya, Garbuzov, et al., 1976
Comment MSDC-RI

Kovats' RI, non-polar column, isothermal

Data compiled by: NIST Mass Spectrometry Data Center, William E. Wallace, director

Column type PackedPacked
Active phase Apiezon MApiezon M
Column length (m) 2.12.1
Carrier gas He or N2N2
Substrate Chromosorb W, AW-DMCSChromosorb W
Column diameter (mm)
Phase thickness (μm)
Temperature (C) 130.130.
I 1378.1378.
ReferenceGarbuzov, Misharina, et al., 1985Golovnya, Garbuzov, et al., 1976
Comment MSDC-RI MSDC-RI

References

Golovnya, Garbuzov, et al., 1976
Golovnya, R.V.; Garbuzov, V.G.; Misharina, T.A., Gas chromatographic characteristics of sulfur compounds. 2. Normal sulfides, Izv. Akad. Nauk Kaz. SSR Ser. Khim., 1976, 10, 2266-2270. [all data]