trans-Bicyclo[5.5.0]dodecane

Kovats' RI, non-polar column, isothermal

Data compiled by: NIST Mass Spectrometry Data Center, William E. Wallace, director

Column type Capillary
Active phase Squalane
Column length (m) 100.
Carrier gas N2
Substrate
Column diameter (mm) 0.23
Phase thickness (μm)
Temperature (C) 90.
I 1299.
ReferenceEngewald, Epsch, et al., 1976
Comment MSDC-RI

References

Engewald, Epsch, et al., 1976
Engewald, W.; Epsch, K.; Welsch, Th.; Graefe, J., Molekülstruktur und Retentionsverhalten. VI. Retentionsverhalten von bicycle[n.m.0]alkanen bei der gas-adsorptions- und gas-verteilungs-chromatographie, J. Chromatogr., 1976, 119, 119-128, https://doi.org/10.1016/S0021-9673(00)86776-X . [all data]