Trichloro(pentyloxy)silane

Kovats' RI, non-polar column, isothermal

View large format table.

Column type Active phase Temperature (C) I Reference Comment
PackedSE-30100.1010.Kreshkov, Kirichenko, et al., 1975Ar; Column length: 1. m
PackedSE-30150.1000.Kreshkov, Kirichenko, et al., 1975Ar; Column length: 1. m
PackedApiezon L100.990.Kreshkov, Kirichenko, et al., 1975Ar; Column length: 1. m
PackedApiezon L150.980.Kreshkov, Kirichenko, et al., 1975Ar; Column length: 1. m

Normal alkane RI, non-polar column, custom temperature program

View large format table.

Column type Active phase I Reference Comment
PackedSE-301010.Yu and Yang, 2005Program: not specified

References

Kreshkov, Kirichenko, et al., 1975
Kreshkov, A.P.; Kirichenko, É.A.; Markov, B.A., Retention indices of alkoxychlorosilanes, Zh. Anal. Khim., 1975, 30, 2, 286-289. [all data]

Yu and Yang, 2005
Yu, X.; Yang, D., Predicting the Kovats retention index for alkoxyl silicon chlorides and sulfides on stationary phases of different polarity, Fenxi Huaxue, 2005, 33, 1, 101-105. [all data]