1,2,4,5-tetramethylcyclohexane, trans

Kovats' RI, non-polar column, isothermal

View large format table.

Column type Active phase Temperature (C) I Reference Comment
PackedSE-30110.1036.Mitra, Mohan, et al., 1974N2, Chrom W; Column length: 6.1 m
PackedSE-30120.1040.Mitra, Mohan, et al., 1974N2, Chrom W; Column length: 6.1 m
PackedSE-30130.1044.Mitra, Mohan, et al., 1974N2, Chrom W; Column length: 6.1 m
PackedSE-30140.1048.Mitra, Mohan, et al., 1974N2, Chrom W; Column length: 6.1 m
CapillarySE-30130.1035.Mitra, Mohan, et al., 1974, 2H2; Column length: 6.1 m; Column diameter: 3.18 mm
CapillarySE-30150.1040.Mitra, Mohan, et al., 1974, 2H2; Column length: 6.1 m; Column diameter: 3.18 mm
CapillarySE-30160.1043.Mitra, Mohan, et al., 1974, 2H2; Column length: 6.1 m; Column diameter: 3.18 mm
CapillarySE-30170.1045.Mitra, Mohan, et al., 1974, 2H2; Column length: 6.1 m; Column diameter: 3.18 mm

References

Mitra, Mohan, et al., 1974
Mitra, G.D.; Mohan, G.; Sinha, A., Advances in the utilization of the retention index system for characterizing hydrocarbons in complex mixtures by gas chromatography, J. Chromatogr., 1974, 99, 215-230, https://doi.org/10.1016/S0021-9673(00)90857-4 . [all data]

Mitra, Mohan, et al., 1974, 2
Mitra, G.D.; Mohan, G.; Sinha, A., Gas chromatographic analysis of complex hydrocarbon mixtures, J. Chromatogr. A, 1974, 91, 633-648, https://doi.org/10.1016/S0021-9673(01)97944-0 . [all data]