1,2,4,5-tetramethylcyclohexane, cis

Kovats' RI, non-polar column, isothermal

Data compiled by: NIST Mass Spectrometry Data Center, William E. Wallace, director

Column type PackedPackedPackedPackedCapillary
Active phase SE-30SE-30SE-30SE-30SE-30
Column length (m) 6.16.16.16.16.1
Carrier gas N2N2N2N2H2
Substrate Chrom WChrom WChrom WChrom W
Column diameter (mm)     3.18
Phase thickness (μm)
Temperature (C) 110.120.130.140.130.
I 1047.1053.1055.1056.1050.
ReferenceMitra, Mohan, et al., 1974Mitra, Mohan, et al., 1974Mitra, Mohan, et al., 1974Mitra, Mohan, et al., 1974Mitra, Mohan, et al., 1974, 2
Comment MSDC-RI MSDC-RI MSDC-RI MSDC-RI MSDC-RI
Column type Capillary
Active phase SE-30
Column length (m) 6.1
Carrier gas H2
Substrate
Column diameter (mm) 3.18
Phase thickness (μm)
Temperature (C) 140.
I 1054.
ReferenceMitra, Mohan, et al., 1974, 2
Comment MSDC-RI

References

Mitra, Mohan, et al., 1974
Mitra, G.D.; Mohan, G.; Sinha, A., Advances in the utilization of the retention index system for characterizing hydrocarbons in complex mixtures by gas chromatography, J. Chromatogr., 1974, 99, 215-230, https://doi.org/10.1016/S0021-9673(00)90857-4 . [all data]

Mitra, Mohan, et al., 1974, 2
Mitra, G.D.; Mohan, G.; Sinha, A., Gas chromatographic analysis of complex hydrocarbon mixtures, J. Chromatogr. A, 1974, 91, 633-648, https://doi.org/10.1016/S0021-9673(01)97944-0 . [all data]