Silane, ethoxy-, tripropoxy-

Kovats' RI, non-polar column, isothermal

View large format table.

Column type Active phase Temperature (C) I Reference Comment
PackedApiezon L160.1088.Ellrén, Peetre, et al., 1974N2, Chromosorb G
CapillaryApiezon L160.1087.7Peetre, 1974Column length: 50. m; Column diameter: 0.25 mm

Kovats' RI, non-polar column, custom temperature program

View large format table.

Column type Active phase I Reference Comment
CapillaryApiezon L1085.Peetre, 1974Column length: 50. m; Column diameter: 0.25 mm; Program: not specified

References

Ellrén, Peetre, et al., 1974
Ellrén, O.; Peetre, I.-B.; Smith, B.E.F., Gas chromatographic investigation of organometallic compounds and their carbon analogues. I. Determination, calculation and correlation of Kováts retention indices for tetraalkoxysilanes, J. Chromatogr., 1974, 88, 2, 295-310, https://doi.org/10.1016/S0021-9673(00)83154-4 . [all data]

Peetre, 1974
Peetre, I.-B., Gas chromatographic investigation of organometallic compounds and their carbon analogues. II. Improved method for calculating retention indices of tetraalkoxysilanes, J. Chromatogr., 1974, 88, 2, 311-321, https://doi.org/10.1016/S0021-9673(00)83155-6 . [all data]