1-Methyl-trans-2-(trans-2,4-pentdienyl)-cyclopropane

Kovats' RI, non-polar column, isothermal

Data compiled by: NIST Mass Spectrometry Data Center, William E. Wallace, director

Column type CapillaryCapillary
Active phase SqualaneSqualane
Column length (m) 100.100.
Carrier gas
Substrate
Column diameter (mm) 0.250.25
Phase thickness (μm)
Temperature (C) 100.80.
I 885.4884.2
ReferenceSchomburg and Dielmann, 1973Schomburg and Dielmann, 1973
Comment MSDC-RI MSDC-RI

References

Schomburg and Dielmann, 1973
Schomburg, G.; Dielmann, G., Use of retention increments for identification and correlation of saturated and unsaturated cyclopropane hydrocarbons by means of Kovats indices, Anal. Chem., 1973, 45, 9, 1647-1658, https://doi.org/10.1021/ac60331a021 . [all data]