Benzene, 1,2-dipropyl

Kovats' RI, non-polar column, isothermal

Data compiled by: NIST Mass Spectrometry Data Center, William E. Wallace, director

Column type PackedCapillaryCapillaryCapillary
Active phase SqualaneSqualaneSqualaneSqualane
Column length (m)  200.200.200.
Carrier gas  H2H2H2
Substrate
Column diameter (mm)  0.20.20.2
Phase thickness (μm)
Temperature (C) 95.4100.115.130.
I 1188.1190.81195.81200.8
ReferenceSoják, Janák, et al., 1977Soják and Hrivnák, 1972Soják and Hrivnák, 1972Soják and Hrivnák, 1972
Comment MSDC-RI MSDC-RI MSDC-RI MSDC-RI

References

Soják, Janák, et al., 1977
Soják, L.; Janák, J.; Rijks, J.A., Capillary gas chromatography of alkylbenzenes. II. Correlations between the structures and methylene group increments and differences in retention indices of isomers, J. Chromatogr., 1977, 135, 1, 71-84, https://doi.org/10.1016/S0021-9673(00)86303-7 . [all data]

Soják and Hrivnák, 1972
Soják, L.; Hrivnák, J., Open tubular column gas chromatography of the catalytic dehydrogenation products of n-dodecane, J. Chromatogr. Sci., 1972, 10, 11, 701-704, https://doi.org/10.1093/chromsci/10.11.701 . [all data]